Information card for entry 4324334
Formula | C36 H28 Co3 N8 O16 |
Calculated formula | C36 H24 Co3 N8 O16 |
Title of publication | Reversible Single-Crystal-to-Single-Crystal Transformation and Highly Selective Adsorption Property of Three-Dimensional Cobalt(II) Frameworks |
Authors of publication | Zhi Su; Min Chen; Taka-aki Okamura; Man-Sheng Chen; Shui-Sheng Chen; Wei-Yin Sun |
Journal of publication | Inorganic Chemistry |
Year of publication | 2011 |
Journal volume | 50 |
Pages of publication | 985 - 991 |
a | 8.5503 ± 0.0012 Å |
b | 10.07 ± 0.0014 Å |
c | 11.2653 ± 0.0015 Å |
α | 77.638 ± 0.002° |
β | 73.921 ± 0.001° |
γ | 88.716 ± 0.002° |
Cell volume | 909.7 ± 0.2 Å3 |
Cell temperature | 293 K |
Ambient diffraction temperature | 293 K |
Number of distinct elements | 5 |
Space group number | 2 |
Hermann-Mauguin space group symbol | P -1 |
Hall space group symbol | -P 1 |
Residual factor for all reflections | 0.0395 |
Residual factor for significantly intense reflections | 0.0349 |
Weighted residual factors for significantly intense reflections | 0.0904 |
Weighted residual factors for all reflections included in the refinement | 0.0929 |
Goodness-of-fit parameter for all reflections included in the refinement | 1.012 |
Diffraction radiation wavelength | 0.71073 Å |
Diffraction radiation type | MoKα |