Information card for entry 4324335
Formula | C46 H42 Cl Cu6 F36 N13 O6 |
Calculated formula | C46 H42 Cl Cu6 F36 N13 O6 |
Title of publication | Halide and Nitrite Recognizing Hexanuclear Metallacycle Copper(II) Pyrazolates |
Authors of publication | Ahmed A. Mohamed; Simone Ricci; Alfredo Burini; Rossana Galassi; Carlo Santini; Gina M. Chiarella; Doris Y. Melgarejo; John P. Fackler |
Journal of publication | Inorganic Chemistry |
Year of publication | 2011 |
Journal volume | 50 |
Pages of publication | 1014 - 1020 |
a | 12.5942 ± 0.0017 Å |
b | 12.7607 ± 0.0018 Å |
c | 25.769 ± 0.004 Å |
α | 93.835 ± 0.002° |
β | 98.987 ± 0.003° |
γ | 91.077 ± 0.002° |
Cell volume | 4079.6 ± 1 Å3 |
Cell temperature | 110 ± 2 K |
Ambient diffraction temperature | 110 ± 2 K |
Number of distinct elements | 7 |
Space group number | 2 |
Hermann-Mauguin space group symbol | P -1 |
Hall space group symbol | -P 1 |
Residual factor for all reflections | 0.0636 |
Residual factor for significantly intense reflections | 0.0436 |
Weighted residual factors for significantly intense reflections | 0.1007 |
Weighted residual factors for all reflections included in the refinement | 0.1063 |
Goodness-of-fit parameter for all reflections included in the refinement | 1.015 |
Diffraction radiation wavelength | 0.71073 Å |
Diffraction radiation type | MoKα |