Information card for entry 4324362
Formula | C20 H15 Ag Cl N2 O5.5 |
Calculated formula | C20 H12 Ag Cl N2 O4 |
Title of publication | Toward the Self-Assembly of Metal-Organic Nanotubes Using Metal-Metal and π-Stacking Interactions: Bis(pyridylethynyl) Silver(I) Metallo-macrocycles and Coordination Polymers |
Authors of publication | Kelly J. Kilpin; Martin L. Gower; Shane G. Telfer; Geoffrey B. Jameson; James D. Crowley |
Journal of publication | Inorganic Chemistry |
Year of publication | 2011 |
Journal volume | 50 |
Pages of publication | 1123 - 1134 |
a | 9.92 ± 0.001 Å |
b | 10.875 ± 0.001 Å |
c | 11.678 ± 0.001 Å |
α | 112.223 ± 0.001° |
β | 102.814 ± 0.001° |
γ | 106.508 ± 0.001° |
Cell volume | 1038.38 ± 0.17 Å3 |
Cell temperature | 90 ± 2 K |
Ambient diffraction temperature | 90 ± 2 K |
Number of distinct elements | 6 |
Space group number | 2 |
Hermann-Mauguin space group symbol | P -1 |
Hall space group symbol | -P 1 |
Residual factor for all reflections | 0.037 |
Residual factor for significantly intense reflections | 0.035 |
Weighted residual factors for significantly intense reflections | 0.1025 |
Weighted residual factors for all reflections included in the refinement | 0.1051 |
Goodness-of-fit parameter for all reflections included in the refinement | 1.089 |
Diffraction radiation wavelength | 0.71069 Å |
Diffraction radiation type | MoKα |