Information card for entry 4324363
Formula | C42 H32 Ag2 Cl2 N6 O9 |
Calculated formula | C42 H32 Ag2 Cl2 N6 O9 |
Title of publication | Toward the Self-Assembly of Metal-Organic Nanotubes Using Metal-Metal and π-Stacking Interactions: Bis(pyridylethynyl) Silver(I) Metallo-macrocycles and Coordination Polymers |
Authors of publication | Kelly J. Kilpin; Martin L. Gower; Shane G. Telfer; Geoffrey B. Jameson; James D. Crowley |
Journal of publication | Inorganic Chemistry |
Year of publication | 2011 |
Journal volume | 50 |
Pages of publication | 1123 - 1134 |
a | 9.505 ± 0.001 Å |
b | 13.797 ± 0.002 Å |
c | 16.3534 ± 0.0017 Å |
α | 90° |
β | 97.151 ± 0.005° |
γ | 90° |
Cell volume | 2127.9 ± 0.4 Å3 |
Cell temperature | 93 ± 2 K |
Ambient diffraction temperature | 93 ± 2 K |
Number of distinct elements | 6 |
Space group number | 14 |
Hermann-Mauguin space group symbol | P 1 21/n 1 |
Hall space group symbol | -P 2yn |
Residual factor for all reflections | 0.0868 |
Residual factor for significantly intense reflections | 0.077 |
Weighted residual factors for significantly intense reflections | 0.2086 |
Weighted residual factors for all reflections included in the refinement | 0.213 |
Goodness-of-fit parameter for all reflections included in the refinement | 1.508 |
Diffraction radiation wavelength | 0.71073 Å |
Diffraction radiation type | MoKα |