Information card for entry 4324387
Formula | C38 H35 N7 O3 |
Calculated formula | C38 H35 N7 O3 |
Title of publication | A Highly Selective Fluorescent Chemosensor for Zinc Ion and Imaging Application in Living Cells |
Authors of publication | Uday Chand Saha; Basab Chattopadhyay; Koushik Dhara; Sushil Kumar Mandal; Sandipan Sarkar; Anisur Rahman Khuda-Bukhsh; Monika Mukherjee; Madeleine Helliwell; Pabitra Chattopadhyay |
Journal of publication | Inorganic Chemistry |
Year of publication | 2011 |
Journal volume | 50 |
Pages of publication | 1213 - 1219 |
a | 8.8743 ± 0.0007 Å |
b | 9.7691 ± 0.0008 Å |
c | 19.5884 ± 0.0016 Å |
α | 78.249 ± 0.001° |
β | 83.525 ± 0.001° |
γ | 75.916 ± 0.001° |
Cell volume | 1609 ± 0.2 Å3 |
Cell temperature | 100 ± 2 K |
Ambient diffraction temperature | 100 ± 2 K |
Number of distinct elements | 4 |
Space group number | 2 |
Hermann-Mauguin space group symbol | P -1 |
Hall space group symbol | -P 1 |
Residual factor for all reflections | 0.0828 |
Residual factor for significantly intense reflections | 0.0639 |
Weighted residual factors for significantly intense reflections | 0.1425 |
Weighted residual factors for all reflections included in the refinement | 0.1501 |
Goodness-of-fit parameter for all reflections included in the refinement | 1.104 |
Diffraction radiation wavelength | 0.71073 Å |
Diffraction radiation type | MoKα |