Information card for entry 4324388
Formula | C35 H27.5 N8 O8.75 Zn2 |
Calculated formula | C35 H26 N8 O8.75 Zn2 |
Title of publication | A Highly Selective Fluorescent Chemosensor for Zinc Ion and Imaging Application in Living Cells |
Authors of publication | Uday Chand Saha; Basab Chattopadhyay; Koushik Dhara; Sushil Kumar Mandal; Sandipan Sarkar; Anisur Rahman Khuda-Bukhsh; Monika Mukherjee; Madeleine Helliwell; Pabitra Chattopadhyay |
Journal of publication | Inorganic Chemistry |
Year of publication | 2011 |
Journal volume | 50 |
Pages of publication | 1213 - 1219 |
a | 11.77 ± 0.009 Å |
b | 16.65 ± 0.012 Å |
c | 17.942 ± 0.013 Å |
α | 90° |
β | 91.306 ± 0.008° |
γ | 90° |
Cell volume | 3515 ± 4 Å3 |
Cell temperature | 150 K |
Ambient diffraction temperature | 150 ± 2 K |
Number of distinct elements | 5 |
Space group number | 14 |
Hermann-Mauguin space group symbol | P 1 21/n 1 |
Hall space group symbol | -P 2yn |
Residual factor for all reflections | 0.1275 |
Residual factor for significantly intense reflections | 0.0885 |
Weighted residual factors for significantly intense reflections | 0.182 |
Weighted residual factors for all reflections included in the refinement | 0.2045 |
Goodness-of-fit parameter for all reflections included in the refinement | 1.105 |
Diffraction radiation wavelength | 0.6889 Å |
Diffraction radiation type | synchrotron |