Information card for entry 4324397
Chemical name | Bis(2-(4-(2-phenylethynyl)phenyl)ethynyl))-(1,1'-dipentyl-3,3'-methylene-diimidazoline-\\ 2,2'-diylidene)-platinum(II) dichloromethane solvate |
Formula | C50 H48 Cl2 N4 Pt |
Calculated formula | C50 H48 Cl2 N4 Pt |
Title of publication | Synthesis and Luminescent Properties of cis Bis-N-Heterocyclic Carbene Platinum(II) Bis-Arylacetylide Complexes |
Authors of publication | Yuzhen Zhang; Jai Anand Garg; Clément Michelin; Thomas Fox; Olivier Blacque; Koushik Venkatesan |
Journal of publication | Inorganic Chemistry |
Year of publication | 2011 |
Journal volume | 50 |
Pages of publication | 1220 - 1228 |
a | 10.2966 ± 0.0003 Å |
b | 36.5438 ± 0.0009 Å |
c | 11.4905 ± 0.0002 Å |
α | 90° |
β | 90° |
γ | 90° |
Cell volume | 4323.61 ± 0.18 Å3 |
Cell temperature | 183 ± 2 K |
Ambient diffraction temperature | 183 ± 2 K |
Number of distinct elements | 5 |
Space group number | 62 |
Hermann-Mauguin space group symbol | P n m a |
Hall space group symbol | -P 2ac 2n |
Residual factor for all reflections | 0.0887 |
Residual factor for significantly intense reflections | 0.0699 |
Weighted residual factors for significantly intense reflections | 0.1625 |
Weighted residual factors for all reflections included in the refinement | 0.167 |
Goodness-of-fit parameter for all reflections included in the refinement | 1.18 |
Diffraction radiation wavelength | 0.71073 Å |
Diffraction radiation type | MoKα |