Information card for entry 4324398
Chemical name | Diiodo-(1,1'-dipentyl-3,3'-methylene-diimidazoline-2,2'-diylidene)-platinum(II) dichloromethane solvate |
Formula | C39 H66 Cl10 I4 N8 Pt2 |
Calculated formula | C39 H66 Cl10 I4 N8 Pt2 |
Title of publication | Synthesis and Luminescent Properties of cis Bis-N-Heterocyclic Carbene Platinum(II) Bis-Arylacetylide Complexes |
Authors of publication | Yuzhen Zhang; Jai Anand Garg; Clément Michelin; Thomas Fox; Olivier Blacque; Koushik Venkatesan |
Journal of publication | Inorganic Chemistry |
Year of publication | 2011 |
Journal volume | 50 |
Pages of publication | 1220 - 1228 |
a | 31.7153 ± 0.0011 Å |
b | 9.0519 ± 0.0003 Å |
c | 21.9061 ± 0.0018 Å |
α | 90° |
β | 102.644 ± 0.005° |
γ | 90° |
Cell volume | 6136.4 ± 0.6 Å3 |
Cell temperature | 183 ± 2 K |
Ambient diffraction temperature | 183 ± 2 K |
Number of distinct elements | 6 |
Space group number | 15 |
Hermann-Mauguin space group symbol | C 1 2/c 1 |
Hall space group symbol | -C 2yc |
Residual factor for all reflections | 0.0571 |
Residual factor for significantly intense reflections | 0.0344 |
Weighted residual factors for significantly intense reflections | 0.0713 |
Weighted residual factors for all reflections included in the refinement | 0.0752 |
Goodness-of-fit parameter for all reflections included in the refinement | 0.983 |
Diffraction radiation wavelength | 0.71073 Å |
Diffraction radiation type | MoKα |