Information card for entry 4324403
Formula | C28 H20 As Au N4 |
Calculated formula | C28 H20 As Au N4 |
SMILES | [Au](C#N)(C#N)(C#N)C#N.[As+](c1ccccc1)(c1ccccc1)(c1ccccc1)c1ccccc1 |
Title of publication | Aggregation of [Au(CN)4]- Anions: Examination by Crystallography and 15N CP-MAS NMR and the Structural Factors Influencing Intermolecular Au...N Interactions |
Authors of publication | Andrew R. Geisheimer; John E. C. Wren; Vladimir K. Michaelis; Masayuki Kobayashi; Ken Sakai; Scott Kroeker; Daniel B. Leznoff |
Journal of publication | Inorganic Chemistry |
Year of publication | 2011 |
Journal volume | 50 |
Pages of publication | 1265 - 1274 |
a | 10.5193 ± 0.0009 Å |
b | 10.599 ± 0.0009 Å |
c | 12.7155 ± 0.0011 Å |
α | 96.057 ± 0.004° |
β | 103.596 ± 0.004° |
γ | 106.681 ± 0.004° |
Cell volume | 1297 ± 0.2 Å3 |
Cell temperature | 293 K |
Ambient diffraction temperature | 293 K |
Number of distinct elements | 5 |
Space group number | 2 |
Hermann-Mauguin space group symbol | P -1 |
Hall space group symbol | -P 1 |
Residual factor for all reflections | 0.034 |
Residual factor for significantly intense reflections | 0.0232 |
Weighted residual factors for all reflections | 0.037 |
Weighted residual factors for significantly intense reflections | 0.0296 |
Weighted residual factors for all reflections included in the refinement | 0.0289 |
Goodness-of-fit parameter for all reflections included in the refinement | 0.677 |
Diffraction radiation wavelength | 0.71073 Å |
Diffraction radiation type | MoKα |