Information card for entry 4324404
Formula | C40 H30 Au N5 P2 |
Calculated formula | C40 H30 Au N5 P2 |
SMILES | [Au](C#N)(C#N)(C#N)C#N.P(=N[P+](c1ccccc1)(c1ccccc1)c1ccccc1)(c1ccccc1)(c1ccccc1)c1ccccc1 |
Title of publication | Aggregation of [Au(CN)4]- Anions: Examination by Crystallography and 15N CP-MAS NMR and the Structural Factors Influencing Intermolecular Au...N Interactions |
Authors of publication | Andrew R. Geisheimer; John E. C. Wren; Vladimir K. Michaelis; Masayuki Kobayashi; Ken Sakai; Scott Kroeker; Daniel B. Leznoff |
Journal of publication | Inorganic Chemistry |
Year of publication | 2011 |
Journal volume | 50 |
Pages of publication | 1265 - 1274 |
a | 16.7592 ± 0.0005 Å |
b | 14.644 ± 0.0004 Å |
c | 15.6117 ± 0.0004 Å |
α | 90° |
β | 103.183 ± 0.001° |
γ | 90° |
Cell volume | 3730.48 ± 0.18 Å3 |
Cell temperature | 293 K |
Ambient diffraction temperature | 293 K |
Number of distinct elements | 5 |
Space group number | 14 |
Hermann-Mauguin space group symbol | P 1 21/c 1 |
Hall space group symbol | -P 2ybc |
Residual factor for all reflections | 0.0706 |
Residual factor for significantly intense reflections | 0.0232 |
Weighted residual factors for all reflections | 0.051 |
Weighted residual factors for significantly intense reflections | 0.0274 |
Weighted residual factors for all reflections included in the refinement | 0.0259 |
Goodness-of-fit parameter for all reflections included in the refinement | 0.4607 |
Diffraction radiation wavelength | 0.71073 Å |
Diffraction radiation type | MoKα |