Information card for entry 4324405
Formula | C44 H24 Au2 Co N14 |
Calculated formula | C44 H24 Au2 Co N14 |
SMILES | [Au](C#N)(C#N)(C#N)C#N.[Au](C#N)(C#N)(C#N)C#N.[Co]123([n]4cccc5ccc6ccc[n]1c6c45)([n]1cccc4ccc5ccc[n]2c5c14)[n]1cccc2ccc4ccc[n]3c4c12 |
Title of publication | Aggregation of [Au(CN)4]- Anions: Examination by Crystallography and 15N CP-MAS NMR and the Structural Factors Influencing Intermolecular Au...N Interactions |
Authors of publication | Andrew R. Geisheimer; John E. C. Wren; Vladimir K. Michaelis; Masayuki Kobayashi; Ken Sakai; Scott Kroeker; Daniel B. Leznoff |
Journal of publication | Inorganic Chemistry |
Year of publication | 2011 |
Journal volume | 50 |
Pages of publication | 1265 - 1274 |
a | 11.2733 ± 0.0003 Å |
b | 11.3956 ± 0.0003 Å |
c | 16.4575 ± 0.0004 Å |
α | 78.646 ± 0.001° |
β | 79.206 ± 0.001° |
γ | 83.83 ± 0.001° |
Cell volume | 2030.7 ± 0.09 Å3 |
Cell temperature | 293 K |
Ambient diffraction temperature | 293 K |
Number of distinct elements | 5 |
Space group number | 2 |
Hermann-Mauguin space group symbol | P -1 |
Hall space group symbol | -P 1 |
Residual factor for all reflections | 0.0683 |
Residual factor for significantly intense reflections | 0.0331 |
Weighted residual factors for all reflections | 0.067 |
Weighted residual factors for significantly intense reflections | 0.0405 |
Weighted residual factors for all reflections included in the refinement | 0.0388 |
Goodness-of-fit parameter for all reflections included in the refinement | 0.5954 |
Diffraction radiation wavelength | 0.71073 Å |
Diffraction radiation type | MoKα |