Information card for entry 4324408
Formula | C14 H24 Au2 N14 Ni |
Calculated formula | C14 H24 Au2 N14 Ni |
Title of publication | Aggregation of [Au(CN)4]- Anions: Examination by Crystallography and 15N CP-MAS NMR and the Structural Factors Influencing Intermolecular Au...N Interactions |
Authors of publication | Andrew R. Geisheimer; John E. C. Wren; Vladimir K. Michaelis; Masayuki Kobayashi; Ken Sakai; Scott Kroeker; Daniel B. Leznoff |
Journal of publication | Inorganic Chemistry |
Year of publication | 2011 |
Journal volume | 50 |
Pages of publication | 1265 - 1274 |
a | 13.865 ± 0.002 Å |
b | 12.345 ± 0.002 Å |
c | 16.213 ± 0.003 Å |
α | 90° |
β | 112.002 ± 0.002° |
γ | 90° |
Cell volume | 2573 ± 0.7 Å3 |
Cell temperature | 293 K |
Ambient diffraction temperature | 293 K |
Number of distinct elements | 5 |
Space group number | 14 |
Hermann-Mauguin space group symbol | P 1 21/c 1 |
Hall space group symbol | -P 2ybc |
Residual factor for all reflections | 0.0348 |
Residual factor for significantly intense reflections | 0.0246 |
Weighted residual factors for all reflections | 0.0306 |
Weighted residual factors for significantly intense reflections | 0.0266 |
Weighted residual factors for all reflections included in the refinement | 0.0265 |
Goodness-of-fit parameter for all reflections included in the refinement | 1.3864 |
Diffraction radiation wavelength | 0.71073 Å |
Diffraction radiation type | MoKα |