Information card for entry 4324409
Formula | C12 H25 Au3 Co N18 O4 |
Calculated formula | C12 H25 Au3 Co N18 O4 |
Title of publication | Aggregation of [Au(CN)4]- Anions: Examination by Crystallography and 15N CP-MAS NMR and the Structural Factors Influencing Intermolecular Au...N Interactions |
Authors of publication | Andrew R. Geisheimer; John E. C. Wren; Vladimir K. Michaelis; Masayuki Kobayashi; Ken Sakai; Scott Kroeker; Daniel B. Leznoff |
Journal of publication | Inorganic Chemistry |
Year of publication | 2011 |
Journal volume | 50 |
Pages of publication | 1265 - 1274 |
a | 7.4044 ± 0.0001 Å |
b | 18.9411 ± 0.0003 Å |
c | 21.4134 ± 0.0003 Å |
α | 90° |
β | 90° |
γ | 90° |
Cell volume | 3003.18 ± 0.08 Å3 |
Cell temperature | 293 K |
Ambient diffraction temperature | 293 K |
Number of distinct elements | 6 |
Space group number | 19 |
Hermann-Mauguin space group symbol | P 21 21 21 |
Hall space group symbol | P 2ac 2ab |
Residual factor for all reflections | 0.0318 |
Residual factor for significantly intense reflections | 0.022 |
Weighted residual factors for all reflections | 0.0449 |
Weighted residual factors for significantly intense reflections | 0.029 |
Weighted residual factors for all reflections included in the refinement | 0.0283 |
Goodness-of-fit parameter for all reflections included in the refinement | 0.5187 |
Diffraction radiation wavelength | 0.71073 Å |
Diffraction radiation type | MoKα |