Information card for entry 4324429
Formula | C20 H19 Cl2 P Pt Se |
Calculated formula | C20 H19 Cl2 P Pt Se |
SMILES | [Pt]1([P](c2ccccc2)(c2ccccc2)CC[Se]1c1ccccc1)(Cl)Cl |
Title of publication | Chelating Effect as a Driving Force for the Selective Formation of Heteroligated Pt(II) Complexes with Bidentate Phosphino-Chalcoether Ligands |
Authors of publication | Mari S. Rosen; Alexander M. Spokoyny; Charles W. Machan; Charlotte Stern; Amy Sarjeant; Chad A. Mirkin |
Journal of publication | Inorganic Chemistry |
Year of publication | 2011 |
Journal volume | 50 |
Pages of publication | 1411 - 1419 |
a | 8.3212 ± 0.0003 Å |
b | 12.8894 ± 0.0008 Å |
c | 9.5294 ± 0.0003 Å |
α | 90° |
β | 100.849 ± 0.002° |
γ | 90° |
Cell volume | 1003.81 ± 0.08 Å3 |
Cell temperature | 100 ± 2 K |
Ambient diffraction temperature | 100 ± 2 K |
Number of distinct elements | 6 |
Space group number | 4 |
Hermann-Mauguin space group symbol | P 1 21 1 |
Hall space group symbol | P 2yb |
Residual factor for all reflections | 0.0329 |
Residual factor for significantly intense reflections | 0.0328 |
Weighted residual factors for significantly intense reflections | 0.0804 |
Weighted residual factors for all reflections included in the refinement | 0.0805 |
Goodness-of-fit parameter for all reflections included in the refinement | 1.066 |
Diffraction radiation wavelength | 1.54178 Å |
Diffraction radiation type | CuKα |