Information card for entry 4324430
Formula | C16 H19 Cl4 P Pt Se |
Calculated formula | C16 H19 Cl4 P Pt Se |
SMILES | [Pt]1([P](c2ccccc2)(c2ccccc2)CC[Se]1C)(Cl)Cl.ClCCl |
Title of publication | Chelating Effect as a Driving Force for the Selective Formation of Heteroligated Pt(II) Complexes with Bidentate Phosphino-Chalcoether Ligands |
Authors of publication | Mari S. Rosen; Alexander M. Spokoyny; Charles W. Machan; Charlotte Stern; Amy Sarjeant; Chad A. Mirkin |
Journal of publication | Inorganic Chemistry |
Year of publication | 2011 |
Journal volume | 50 |
Pages of publication | 1411 - 1419 |
a | 14.1323 ± 0.0002 Å |
b | 14.2531 ± 0.0002 Å |
c | 19.8957 ± 0.0003 Å |
α | 90° |
β | 90° |
γ | 90° |
Cell volume | 4007.57 ± 0.1 Å3 |
Cell temperature | 100 ± 2 K |
Ambient diffraction temperature | 100 ± 2 K |
Number of distinct elements | 6 |
Space group number | 61 |
Hermann-Mauguin space group symbol | P b c a |
Hall space group symbol | -P 2ac 2ab |
Residual factor for all reflections | 0.0439 |
Residual factor for significantly intense reflections | 0.0379 |
Weighted residual factors for significantly intense reflections | 0.0993 |
Weighted residual factors for all reflections included in the refinement | 0.1026 |
Goodness-of-fit parameter for all reflections included in the refinement | 1.078 |
Diffraction radiation wavelength | 0.71073 Å |
Diffraction radiation type | MoKα |