Information card for entry 4324434
Formula | C30 H34 Cl5 P2 Pt Se |
Calculated formula | C30 H34 Cl5 P2 Pt Se |
Title of publication | Chelating Effect as a Driving Force for the Selective Formation of Heteroligated Pt(II) Complexes with Bidentate Phosphino-Chalcoether Ligands |
Authors of publication | Mari S. Rosen; Alexander M. Spokoyny; Charles W. Machan; Charlotte Stern; Amy Sarjeant; Chad A. Mirkin |
Journal of publication | Inorganic Chemistry |
Year of publication | 2011 |
Journal volume | 50 |
Pages of publication | 1411 - 1419 |
a | 9.3776 ± 0.0002 Å |
b | 12.0512 ± 0.0002 Å |
c | 15.576 ± 0.0002 Å |
α | 101.421 ± 0.001° |
β | 97.845 ± 0.001° |
γ | 95.902 ± 0.001° |
Cell volume | 1693.91 ± 0.05 Å3 |
Cell temperature | 100 ± 2 K |
Ambient diffraction temperature | 100 ± 2 K |
Number of distinct elements | 6 |
Space group number | 2 |
Hermann-Mauguin space group symbol | P -1 |
Hall space group symbol | -P 1 |
Residual factor for all reflections | 0.0613 |
Residual factor for significantly intense reflections | 0.0368 |
Weighted residual factors for significantly intense reflections | 0.0797 |
Weighted residual factors for all reflections included in the refinement | 0.1051 |
Goodness-of-fit parameter for all reflections included in the refinement | 1.033 |
Diffraction radiation wavelength | 0.71073 Å |
Diffraction radiation type | MoKα |