Information card for entry 4324435
Formula | C31 H36 Cl6 P2 Pt S |
Calculated formula | C31 H36 Cl6 P2 Pt S |
Title of publication | Chelating Effect as a Driving Force for the Selective Formation of Heteroligated Pt(II) Complexes with Bidentate Phosphino-Chalcoether Ligands |
Authors of publication | Mari S. Rosen; Alexander M. Spokoyny; Charles W. Machan; Charlotte Stern; Amy Sarjeant; Chad A. Mirkin |
Journal of publication | Inorganic Chemistry |
Year of publication | 2011 |
Journal volume | 50 |
Pages of publication | 1411 - 1419 |
a | 9.3837 ± 0.0003 Å |
b | 12.2736 ± 0.0004 Å |
c | 15.4526 ± 0.0005 Å |
α | 101.517 ± 0.002° |
β | 97.069 ± 0.002° |
γ | 96.763 ± 0.002° |
Cell volume | 1711.98 ± 0.1 Å3 |
Cell temperature | 106 ± 2 K |
Ambient diffraction temperature | 106 ± 2 K |
Number of distinct elements | 6 |
Space group number | 2 |
Hermann-Mauguin space group symbol | P -1 |
Hall space group symbol | -P 1 |
Residual factor for all reflections | 0.1473 |
Residual factor for significantly intense reflections | 0.0739 |
Weighted residual factors for significantly intense reflections | 0.153 |
Weighted residual factors for all reflections included in the refinement | 0.1958 |
Goodness-of-fit parameter for all reflections included in the refinement | 1.101 |
Diffraction radiation wavelength | 0.71073 Å |
Diffraction radiation type | MoKα |