Information card for entry 4324641
Formula | C44 H40 N8 Ni O11 |
Calculated formula | C44 H40 N8 Ni O11 |
Title of publication | Six New Metal-Organic Frameworks Based on Polycarboxylate Acids and V-shaped Imidazole-Based Synthon: Syntheses, Crystal Structures, and Properties |
Authors of publication | Jinsong Hu; Liangfang Huang; Xiaoqiang Yao; Ling Qin; Yizhi Li; Zijian Guo; Hegen Zheng; Ziling Xue |
Journal of publication | Inorganic Chemistry |
Year of publication | 2011 |
Journal volume | 50 |
Pages of publication | 2404 - 2414 |
a | 26.548 ± 0.002 Å |
b | 10.1451 ± 0.0008 Å |
c | 30.495 ± 0.002 Å |
α | 90° |
β | 102.028 ± 0.002° |
γ | 90° |
Cell volume | 8033 ± 1 Å3 |
Cell temperature | 293 ± 2 K |
Ambient diffraction temperature | 293 ± 2 K |
Number of distinct elements | 5 |
Space group number | 15 |
Hermann-Mauguin space group symbol | C 1 2/c 1 |
Hall space group symbol | -C 2yc |
Residual factor for all reflections | 0.0776 |
Residual factor for significantly intense reflections | 0.0531 |
Weighted residual factors for significantly intense reflections | 0.1196 |
Weighted residual factors for all reflections included in the refinement | 0.1275 |
Goodness-of-fit parameter for all reflections included in the refinement | 0.975 |
Diffraction radiation wavelength | 0.71073 Å |
Diffraction radiation type | MoKα |