Information card for entry 4324642
Formula | C52 H36 Mn2 N8 O12 |
Calculated formula | C52 H36 Mn2 N8 O12 |
Title of publication | Six New Metal-Organic Frameworks Based on Polycarboxylate Acids and V-shaped Imidazole-Based Synthon: Syntheses, Crystal Structures, and Properties |
Authors of publication | Jinsong Hu; Liangfang Huang; Xiaoqiang Yao; Ling Qin; Yizhi Li; Zijian Guo; Hegen Zheng; Ziling Xue |
Journal of publication | Inorganic Chemistry |
Year of publication | 2011 |
Journal volume | 50 |
Pages of publication | 2404 - 2414 |
a | 11.7405 ± 0.001 Å |
b | 19.0544 ± 0.0018 Å |
c | 19.8722 ± 0.0018 Å |
α | 90° |
β | 97.039 ± 0.002° |
γ | 90° |
Cell volume | 4412.1 ± 0.7 Å3 |
Cell temperature | 273 ± 2 K |
Ambient diffraction temperature | 273 ± 2 K |
Number of distinct elements | 5 |
Space group number | 14 |
Hermann-Mauguin space group symbol | P 1 21/c 1 |
Hall space group symbol | -P 2ybc |
Residual factor for all reflections | 0.0729 |
Residual factor for significantly intense reflections | 0.0481 |
Weighted residual factors for significantly intense reflections | 0.0858 |
Weighted residual factors for all reflections included in the refinement | 0.093 |
Goodness-of-fit parameter for all reflections included in the refinement | 0.965 |
Diffraction radiation wavelength | 0.71073 Å |
Diffraction radiation type | MoKα |