Information card for entry 4327075
Formula | C35 H48 N2 |
Calculated formula | C35 H48 N2 |
Title of publication | Preparation, Characterization, and Theoretical Analysis of Group 14 Element(I) Dimers: A Case Study of Magnesium(I) Compounds as Reducing Agents in Inorganic Synthesis |
Authors of publication | Cameron Jones; Simon J. Bonyhady; Nicole Holzmann; Gernot Frenking; Andreas Stasch |
Journal of publication | Inorganic Chemistry |
Year of publication | 2011 |
Journal volume | 50 |
Pages of publication | 12315 - 12325 |
a | 9.899 ± 0.002 Å |
b | 10.533 ± 0.002 Å |
c | 15.683 ± 0.003 Å |
α | 84.35 ± 0.03° |
β | 80.53 ± 0.03° |
γ | 71.89 ± 0.03° |
Cell volume | 1531.1 ± 0.6 Å3 |
Cell temperature | 173 ± 2 K |
Ambient diffraction temperature | 173 ± 2 K |
Number of distinct elements | 3 |
Space group number | 2 |
Hermann-Mauguin space group symbol | P -1 |
Hall space group symbol | -P 1 |
Residual factor for all reflections | 0.0955 |
Residual factor for significantly intense reflections | 0.0555 |
Weighted residual factors for significantly intense reflections | 0.13 |
Weighted residual factors for all reflections included in the refinement | 0.1513 |
Goodness-of-fit parameter for all reflections included in the refinement | 1.027 |
Diffraction radiation wavelength | 0.71073 Å |
Diffraction radiation type | MoKα |