Information card for entry 4327076
Formula | C70 H94 Li2 N4 |
Calculated formula | C70 H94 Li2 N4 |
Title of publication | Preparation, Characterization, and Theoretical Analysis of Group 14 Element(I) Dimers: A Case Study of Magnesium(I) Compounds as Reducing Agents in Inorganic Synthesis |
Authors of publication | Cameron Jones; Simon J. Bonyhady; Nicole Holzmann; Gernot Frenking; Andreas Stasch |
Journal of publication | Inorganic Chemistry |
Year of publication | 2011 |
Journal volume | 50 |
Pages of publication | 12315 - 12325 |
a | 11.698 ± 0.002 Å |
b | 13.099 ± 0.003 Å |
c | 24.937 ± 0.005 Å |
α | 87.85 ± 0.03° |
β | 76.53 ± 0.03° |
γ | 65.22 ± 0.03° |
Cell volume | 3366 ± 1.5 Å3 |
Cell temperature | 173 ± 2 K |
Ambient diffraction temperature | 173 ± 2 K |
Number of distinct elements | 4 |
Space group number | 2 |
Hermann-Mauguin space group symbol | P -1 |
Hall space group symbol | -P 1 |
Residual factor for all reflections | 0.1439 |
Residual factor for significantly intense reflections | 0.0792 |
Weighted residual factors for significantly intense reflections | 0.217 |
Weighted residual factors for all reflections included in the refinement | 0.2435 |
Goodness-of-fit parameter for all reflections included in the refinement | 1.065 |
Diffraction radiation wavelength | 0.71073 Å |
Diffraction radiation type | MoKα |