Information card for entry 4327085
Common name | RTLIEU |
Formula | C64 H104 Cl3 Eu2 F3 N16 O30.16 |
Calculated formula | C64 H104 Cl3 Eu2 F3 N16 O30.158 |
Title of publication | Positively Charged Lanthanide Complexes with Cyclen-Based Ligands: Synthesis, Solid-State and Solution Structure, and Fluoride Interaction |
Authors of publication | Luís M. P. Lima; Alexandre Lecointre; Jean-François Morfin; Andrés de Blas; Dimitris Visvikis; Loïc J. Charbonnière; Carlos Platas-Iglesias; Raphaël Tripier |
Journal of publication | Inorganic Chemistry |
Year of publication | 2011 |
Journal volume | 50 |
Pages of publication | 12508 - 12521 |
a | 13.3092 ± 0.0003 Å |
b | 16.5654 ± 0.0003 Å |
c | 20.9868 ± 0.0004 Å |
α | 90° |
β | 90.018 ± 0.001° |
γ | 90° |
Cell volume | 4627.01 ± 0.16 Å3 |
Cell temperature | 100 ± 2 K |
Ambient diffraction temperature | 100 ± 2 K |
Number of distinct elements | 7 |
Space group number | 13 |
Hermann-Mauguin space group symbol | P 1 2/n 1 |
Hall space group symbol | -P 2yac |
Residual factor for all reflections | 0.0727 |
Residual factor for significantly intense reflections | 0.0417 |
Weighted residual factors for significantly intense reflections | 0.0976 |
Weighted residual factors for all reflections included in the refinement | 0.1117 |
Goodness-of-fit parameter for all reflections included in the refinement | 1.021 |
Diffraction radiation probe | x-ray |
Diffraction radiation wavelength | 0.71073 Å |
Diffraction radiation type | MoKα |