Information card for entry 4327086
Formula | C32 H71 Cl3 La N8 O16 |
Calculated formula | C32 H71.004 Cl3 La N8 O16.004 |
Title of publication | Positively Charged Lanthanide Complexes with Cyclen-Based Ligands: Synthesis, Solid-State and Solution Structure, and Fluoride Interaction |
Authors of publication | Luís M. P. Lima; Alexandre Lecointre; Jean-François Morfin; Andrés de Blas; Dimitris Visvikis; Loïc J. Charbonnière; Carlos Platas-Iglesias; Raphaël Tripier |
Journal of publication | Inorganic Chemistry |
Year of publication | 2011 |
Journal volume | 50 |
Pages of publication | 12508 - 12521 |
a | 14.2869 ± 0.0004 Å |
b | 14.2869 ± 0.0004 Å |
c | 23.9665 ± 0.0011 Å |
α | 90° |
β | 90° |
γ | 90° |
Cell volume | 4891.9 ± 0.3 Å3 |
Cell temperature | 170 ± 2 K |
Ambient diffraction temperature | 170 ± 2 K |
Number of distinct elements | 6 |
Space group number | 130 |
Hermann-Mauguin space group symbol | P 4/n c c :2 |
Hall space group symbol | -P 4a 2ac |
Residual factor for all reflections | 0.0861 |
Residual factor for significantly intense reflections | 0.0446 |
Weighted residual factors for significantly intense reflections | 0.1238 |
Weighted residual factors for all reflections included in the refinement | 0.1381 |
Goodness-of-fit parameter for all reflections included in the refinement | 1.134 |
Diffraction radiation probe | x-ray |
Diffraction radiation wavelength | 0.71073 Å |
Diffraction radiation type | MoKα |