Information card for entry 4327100
Formula | C36 H30 Cl P2 Rh |
Calculated formula | C36 H30 Cl P2 Rh |
Title of publication | Coordination and Organometallic Chemistry of Relevance to the Rhodium-Based Catalyst for Ethylene Hydroamination |
Authors of publication | Aurélien Béthegnies; Vladislava A. Kirkina; Oleg A. Filippov; Jean-Claude Daran; Natalia V. Belkova; Elena Shubina; Rinaldo Poli |
Journal of publication | Inorganic Chemistry |
Year of publication | 2011 |
Journal volume | 50 |
Pages of publication | 12539 - 12552 |
a | 9.7226 ± 0.0002 Å |
b | 12.6361 ± 0.0003 Å |
c | 13.7002 ± 0.0004 Å |
α | 85.091 ± 0.002° |
β | 83.067 ± 0.002° |
γ | 79.384 ± 0.002° |
Cell volume | 1638.78 ± 0.07 Å3 |
Cell temperature | 180 ± 2 K |
Ambient diffraction temperature | 180 ± 2 K |
Number of distinct elements | 5 |
Space group number | 2 |
Hermann-Mauguin space group symbol | P -1 |
Hall space group symbol | -P 1 |
Residual factor for all reflections | 0.0361 |
Residual factor for significantly intense reflections | 0.0283 |
Weighted residual factors for significantly intense reflections | 0.0893 |
Weighted residual factors for all reflections included in the refinement | 0.0938 |
Goodness-of-fit parameter for all reflections included in the refinement | 1.081 |
Diffraction radiation wavelength | 0.71073 Å |
Diffraction radiation type | MoKα |