Information card for entry 4327101
Formula | C51 H96 Cl12 N9 Na O8 Pt5 Sn6 |
Calculated formula | C51 H96 Cl12 N9 Na O8 Pt5 Sn6 |
Title of publication | Electronic Stabilization of trigonal Bipyramidal Clusters: the Role of the Sn(II) Ions in [Pt5(CO)5{Cl2Sn(μ-OR)SnCl2}3]3- (R = H, Me, Et, iPr) |
Authors of publication | Alessandro Ceriotti; Matteo Daghetta; Simona El Afefey; Andrea Ienco; Giuliano Longoni; Gabriele Manca; Carlo Mealli; Stefano Zacchini; Salvatore Zarra |
Journal of publication | Inorganic Chemistry |
Year of publication | 2011 |
Journal volume | 50 |
Pages of publication | 12553 - 12561 |
a | 14.007 ± 0.003 Å |
b | 22.74 ± 0.005 Å |
c | 14.397 ± 0.003 Å |
α | 90° |
β | 91.844 ± 0.003° |
γ | 90° |
Cell volume | 4583.3 ± 1.7 Å3 |
Cell temperature | 100 ± 2 K |
Ambient diffraction temperature | 100 ± 2 K |
Number of distinct elements | 8 |
Space group number | 11 |
Hermann-Mauguin space group symbol | P 1 21/m 1 |
Hall space group symbol | -P 2yb |
Residual factor for all reflections | 0.0974 |
Residual factor for significantly intense reflections | 0.0644 |
Weighted residual factors for significantly intense reflections | 0.1655 |
Weighted residual factors for all reflections included in the refinement | 0.192 |
Goodness-of-fit parameter for all reflections included in the refinement | 1.047 |
Diffraction radiation wavelength | 0.71073 Å |
Diffraction radiation type | MoKα |