Information card for entry 4327105
Formula | C7 H7 Ag2 Br O8 S |
Calculated formula | C7 H7 Ag2 Br O8 S |
Title of publication | New Family of Silver(I) Complexes Based on Hydroxyl and Carboxyl Groups Decorated Arenesulfonic Acid: Syntheses, Structures, and Luminescent Properties |
Authors of publication | Xiang-Qian Fang; Zhao-Peng Deng; Li-Hua Huo; Wang Wan; Zhi-Biao Zhu; Hui Zhao; Shan Gao |
Journal of publication | Inorganic Chemistry |
Year of publication | 2011 |
Journal volume | 50 |
Pages of publication | 12562 - 12574 |
a | 6.6639 ± 0.0013 Å |
b | 9.5487 ± 0.0019 Å |
c | 9.977 ± 0.002 Å |
α | 84.26 ± 0.03° |
β | 75.75 ± 0.03° |
γ | 86.71 ± 0.03° |
Cell volume | 611.9 ± 0.2 Å3 |
Cell temperature | 295 ± 2 K |
Ambient diffraction temperature | 295 ± 2 K |
Number of distinct elements | 6 |
Space group number | 2 |
Hermann-Mauguin space group symbol | P -1 |
Hall space group symbol | -P 1 |
Residual factor for all reflections | 0.0576 |
Residual factor for significantly intense reflections | 0.0469 |
Weighted residual factors for significantly intense reflections | 0.1141 |
Weighted residual factors for all reflections included in the refinement | 0.1384 |
Goodness-of-fit parameter for all reflections included in the refinement | 1.017 |
Diffraction radiation wavelength | 0.71073 Å |
Diffraction radiation type | MoKα |