Information card for entry 4327106
Formula | C14 H24 Ag4 N4 O14 S2 |
Calculated formula | C14 H24 Ag4 N4 O14 S2 |
SMILES | c1(c(cc(cc1)C(O[Ag][NH3])=[O][Ag][NH3])O)S(=O)(=O)[O-].O |
Title of publication | New Family of Silver(I) Complexes Based on Hydroxyl and Carboxyl Groups Decorated Arenesulfonic Acid: Syntheses, Structures, and Luminescent Properties |
Authors of publication | Xiang-Qian Fang; Zhao-Peng Deng; Li-Hua Huo; Wang Wan; Zhi-Biao Zhu; Hui Zhao; Shan Gao |
Journal of publication | Inorganic Chemistry |
Year of publication | 2011 |
Journal volume | 50 |
Pages of publication | 12562 - 12574 |
a | 13.257 ± 0.003 Å |
b | 6.5426 ± 0.0013 Å |
c | 14.635 ± 0.003 Å |
α | 90° |
β | 104.98 ± 0.03° |
γ | 90° |
Cell volume | 1226.2 ± 0.5 Å3 |
Cell temperature | 295 ± 2 K |
Ambient diffraction temperature | 295 ± 2 K |
Number of distinct elements | 6 |
Space group number | 14 |
Hermann-Mauguin space group symbol | P 1 21/c 1 |
Hall space group symbol | -P 2ybc |
Residual factor for all reflections | 0.1165 |
Residual factor for significantly intense reflections | 0.0727 |
Weighted residual factors for significantly intense reflections | 0.1799 |
Weighted residual factors for all reflections included in the refinement | 0.2164 |
Goodness-of-fit parameter for all reflections included in the refinement | 1.036 |
Diffraction radiation wavelength | 0.71073 Å |
Diffraction radiation type | MoKα |