Information card for entry 4327107
Formula | C7 H7 Ag O7 S |
Calculated formula | C7 H7 Ag O7 S |
Title of publication | New Family of Silver(I) Complexes Based on Hydroxyl and Carboxyl Groups Decorated Arenesulfonic Acid: Syntheses, Structures, and Luminescent Properties |
Authors of publication | Xiang-Qian Fang; Zhao-Peng Deng; Li-Hua Huo; Wang Wan; Zhi-Biao Zhu; Hui Zhao; Shan Gao |
Journal of publication | Inorganic Chemistry |
Year of publication | 2011 |
Journal volume | 50 |
Pages of publication | 12562 - 12574 |
a | 20.417 ± 0.004 Å |
b | 7.7642 ± 0.0016 Å |
c | 11.886 ± 0.002 Å |
α | 90° |
β | 103.96 ± 0.03° |
γ | 90° |
Cell volume | 1828.5 ± 0.6 Å3 |
Cell temperature | 295 ± 2 K |
Ambient diffraction temperature | 295 ± 2 K |
Number of distinct elements | 5 |
Space group number | 15 |
Hermann-Mauguin space group symbol | C 1 2/c 1 |
Hall space group symbol | -C 2yc |
Residual factor for all reflections | 0.0256 |
Residual factor for significantly intense reflections | 0.0216 |
Weighted residual factors for significantly intense reflections | 0.0455 |
Weighted residual factors for all reflections included in the refinement | 0.0532 |
Goodness-of-fit parameter for all reflections included in the refinement | 1.094 |
Diffraction radiation wavelength | 0.71073 Å |
Diffraction radiation type | MoKα |