Information card for entry 4327109
Formula | C7 H12 Ag3 N3 O6 S |
Calculated formula | C7 H12 Ag3 N3 O6 S |
Title of publication | New Family of Silver(I) Complexes Based on Hydroxyl and Carboxyl Groups Decorated Arenesulfonic Acid: Syntheses, Structures, and Luminescent Properties |
Authors of publication | Xiang-Qian Fang; Zhao-Peng Deng; Li-Hua Huo; Wang Wan; Zhi-Biao Zhu; Hui Zhao; Shan Gao |
Journal of publication | Inorganic Chemistry |
Year of publication | 2011 |
Journal volume | 50 |
Pages of publication | 12562 - 12574 |
a | 6.2647 ± 0.0013 Å |
b | 8.3431 ± 0.0017 Å |
c | 12.831 ± 0.003 Å |
α | 89.65 ± 0.03° |
β | 80.19 ± 0.03° |
γ | 83.36 ± 0.03° |
Cell volume | 656.3 ± 0.3 Å3 |
Cell temperature | 295 ± 2 K |
Ambient diffraction temperature | 295 ± 2 K |
Number of distinct elements | 6 |
Space group number | 2 |
Hermann-Mauguin space group symbol | P -1 |
Hall space group symbol | -P 1 |
Residual factor for all reflections | 0.0598 |
Residual factor for significantly intense reflections | 0.0514 |
Weighted residual factors for significantly intense reflections | 0.1493 |
Weighted residual factors for all reflections included in the refinement | 0.1611 |
Goodness-of-fit parameter for all reflections included in the refinement | 1.051 |
Diffraction radiation wavelength | 0.71073 Å |
Diffraction radiation type | MoKα |