Information card for entry 4327110
Formula | C7 H4 Ag2 O6 S |
Calculated formula | C7 H4 Ag2 O6 S |
Title of publication | New Family of Silver(I) Complexes Based on Hydroxyl and Carboxyl Groups Decorated Arenesulfonic Acid: Syntheses, Structures, and Luminescent Properties |
Authors of publication | Xiang-Qian Fang; Zhao-Peng Deng; Li-Hua Huo; Wang Wan; Zhi-Biao Zhu; Hui Zhao; Shan Gao |
Journal of publication | Inorganic Chemistry |
Year of publication | 2011 |
Journal volume | 50 |
Pages of publication | 12562 - 12574 |
a | 6.9889 ± 0.0014 Å |
b | 7.4711 ± 0.0015 Å |
c | 9.6405 ± 0.0019 Å |
α | 70.8 ± 0.03° |
β | 85.46 ± 0.03° |
γ | 73.85 ± 0.03° |
Cell volume | 456.57 ± 0.19 Å3 |
Cell temperature | 295 ± 2 K |
Ambient diffraction temperature | 295 ± 2 K |
Number of distinct elements | 5 |
Space group number | 2 |
Hermann-Mauguin space group symbol | P -1 |
Hall space group symbol | -P 1 |
Residual factor for all reflections | 0.0365 |
Residual factor for significantly intense reflections | 0.031 |
Weighted residual factors for significantly intense reflections | 0.0758 |
Weighted residual factors for all reflections included in the refinement | 0.0871 |
Goodness-of-fit parameter for all reflections included in the refinement | 1.086 |
Diffraction radiation wavelength | 0.71073 Å |
Diffraction radiation type | MoKα |