Information card for entry 4327111
Formula | C14 H12 Ag6 O15 S2 |
Calculated formula | C14 H12 Ag6 O15 S2 |
Title of publication | New Family of Silver(I) Complexes Based on Hydroxyl and Carboxyl Groups Decorated Arenesulfonic Acid: Syntheses, Structures, and Luminescent Properties |
Authors of publication | Xiang-Qian Fang; Zhao-Peng Deng; Li-Hua Huo; Wang Wan; Zhi-Biao Zhu; Hui Zhao; Shan Gao |
Journal of publication | Inorganic Chemistry |
Year of publication | 2011 |
Journal volume | 50 |
Pages of publication | 12562 - 12574 |
a | 10.8102 ± 0.0004 Å |
b | 16.2514 ± 0.0005 Å |
c | 12.5666 ± 0.0004 Å |
α | 90° |
β | 94.559 ± 0.001° |
γ | 90° |
Cell volume | 2200.73 ± 0.13 Å3 |
Cell temperature | 295 ± 2 K |
Ambient diffraction temperature | 295 ± 2 K |
Number of distinct elements | 5 |
Space group number | 14 |
Hermann-Mauguin space group symbol | P 1 21/c 1 |
Hall space group symbol | -P 2ybc |
Residual factor for all reflections | 0.0692 |
Residual factor for significantly intense reflections | 0.0479 |
Weighted residual factors for significantly intense reflections | 0.1162 |
Weighted residual factors for all reflections included in the refinement | 0.1391 |
Goodness-of-fit parameter for all reflections included in the refinement | 1.071 |
Diffraction radiation wavelength | 0.71073 Å |
Diffraction radiation type | MoKα |