Information card for entry 4327140
Formula | C34 H62 N4 Sr |
Calculated formula | C34 H62 N4 Sr |
Title of publication | New Volatile Strontium and Barium Imidazolate Complexes for the Deposition of Group 2 Metal Oxides |
Authors of publication | John A. T. Norman; Melanie Perez; M. S. Kim; Xinjian Lei; Sergei Ivanov; Agnes Derecskei-Kovacs; Laura Matz; Iain Buchanan; Arnold L. Rheingold |
Journal of publication | Inorganic Chemistry |
Year of publication | 2011 |
Journal volume | 50 |
Pages of publication | 12396 - 12398 |
a | 11.125 ± 0.002 Å |
b | 16.014 ± 0.003 Å |
c | 19.036 ± 0.003 Å |
α | 90° |
β | 93.203 ± 0.007° |
γ | 90° |
Cell volume | 3386.1 ± 1 Å3 |
Cell temperature | 100 ± 2 K |
Ambient diffraction temperature | 100 ± 2 K |
Number of distinct elements | 4 |
Space group number | 14 |
Hermann-Mauguin space group symbol | P 1 21/c 1 |
Hall space group symbol | -P 2ybc |
Residual factor for all reflections | 0.1376 |
Residual factor for significantly intense reflections | 0.0954 |
Weighted residual factors for significantly intense reflections | 0.2261 |
Weighted residual factors for all reflections included in the refinement | 0.267 |
Goodness-of-fit parameter for all reflections included in the refinement | 1.116 |
Diffraction radiation wavelength | 1.54178 Å |
Diffraction radiation type | CuKα |