Information card for entry 4327141
Formula | C68 H124 Ba2 N8 |
Calculated formula | C68 H124 Ba2 N8 |
Title of publication | New Volatile Strontium and Barium Imidazolate Complexes for the Deposition of Group 2 Metal Oxides |
Authors of publication | John A. T. Norman; Melanie Perez; M. S. Kim; Xinjian Lei; Sergei Ivanov; Agnes Derecskei-Kovacs; Laura Matz; Iain Buchanan; Arnold L. Rheingold |
Journal of publication | Inorganic Chemistry |
Year of publication | 2011 |
Journal volume | 50 |
Pages of publication | 12396 - 12398 |
a | 10.405 ± 0.0005 Å |
b | 18.4032 ± 0.0009 Å |
c | 19.5021 ± 0.0009 Å |
α | 75.013 ± 0.001° |
β | 85.288 ± 0.001° |
γ | 75.095 ± 0.001° |
Cell volume | 3485.5 ± 0.3 Å3 |
Cell temperature | 100 ± 2 K |
Ambient diffraction temperature | 100 ± 2 K |
Number of distinct elements | 4 |
Space group number | 2 |
Hermann-Mauguin space group symbol | P -1 |
Hall space group symbol | -P 1 |
Residual factor for all reflections | 0.0333 |
Residual factor for significantly intense reflections | 0.0286 |
Weighted residual factors for significantly intense reflections | 0.0727 |
Weighted residual factors for all reflections included in the refinement | 0.076 |
Goodness-of-fit parameter for all reflections included in the refinement | 1.035 |
Diffraction radiation wavelength | 0.71073 Å |
Diffraction radiation type | MoKα |