Information card for entry 4327190
Formula | C22 H28 Cu N2 O4 |
Calculated formula | C22 H28 Cu N2 O4 |
SMILES | [Cu]12(Oc3c(cc(cc3)CCC)C(=[N]1O)C)Oc1c(cc(cc1)CCC)C(=[N]2O)C |
Title of publication | Structural, Magnetic, and Electronic Properties of Phenolic Oxime Complexes of Cu and Ni |
Authors of publication | Alexander M. Whyte; Benjamin Roach; David K. Henderson; Peter A. Tasker; Michio M. Matsushita; Kunio Awaga; Fraser J. White; Patricia Richardson; Neil Robertson |
Journal of publication | Inorganic Chemistry |
Year of publication | 2011 |
Journal volume | 50 |
Pages of publication | 12867 - 12876 |
a | 10.8857 ± 0.0003 Å |
b | 4.7378 ± 0.0001 Å |
c | 19.6051 ± 0.0005 Å |
α | 90° |
β | 92.726 ± 0.002° |
γ | 90° |
Cell volume | 1009.97 ± 0.04 Å3 |
Cell temperature | 100 ± 2 K |
Ambient diffraction temperature | 100 ± 2 K |
Number of distinct elements | 5 |
Space group number | 14 |
Hermann-Mauguin space group symbol | P 1 21/c 1 |
Hall space group symbol | -P 2ybc |
Residual factor for all reflections | 0.0477 |
Residual factor for significantly intense reflections | 0.0385 |
Weighted residual factors for significantly intense reflections | 0.1017 |
Weighted residual factors for all reflections included in the refinement | 0.1077 |
Goodness-of-fit parameter for all reflections included in the refinement | 1.028 |
Diffraction radiation wavelength | 0.71073 Å |
Diffraction radiation type | MoKα |