Information card for entry 4327191
Formula | C22 H28 N2 Ni O4 |
Calculated formula | C22 H28 N2 Ni O4 |
Title of publication | Structural, Magnetic, and Electronic Properties of Phenolic Oxime Complexes of Cu and Ni |
Authors of publication | Alexander M. Whyte; Benjamin Roach; David K. Henderson; Peter A. Tasker; Michio M. Matsushita; Kunio Awaga; Fraser J. White; Patricia Richardson; Neil Robertson |
Journal of publication | Inorganic Chemistry |
Year of publication | 2011 |
Journal volume | 50 |
Pages of publication | 12867 - 12876 |
a | 10.8277 ± 0.0005 Å |
b | 4.6891 ± 0.0002 Å |
c | 19.8063 ± 0.001 Å |
α | 90° |
β | 92.13 ± 0.002° |
γ | 90° |
Cell volume | 1004.91 ± 0.08 Å3 |
Cell temperature | 100 K |
Ambient diffraction temperature | 100 K |
Number of distinct elements | 5 |
Space group number | 14 |
Hermann-Mauguin space group symbol | P 1 21/c 1 |
Hall space group symbol | -P 2ybc |
Residual factor for all reflections | 0.0283 |
Residual factor for significantly intense reflections | 0.0254 |
Weighted residual factors for all reflections | 0.0754 |
Weighted residual factors for significantly intense reflections | 0.0707 |
Weighted residual factors for all reflections included in the refinement | 0.0754 |
Goodness-of-fit parameter for all reflections included in the refinement | 0.9742 |
Diffraction radiation wavelength | 0.71073 Å |
Diffraction radiation type | MoKα |