Information card for entry 4333409
Formula | C23 H43 B Cl F4 N P2 Rh |
Calculated formula | C23 H43 B Cl F4 N P2 Rh |
Title of publication | Mononuclear Rh(II) PNP-type complexes. Structure and reactivity. |
Authors of publication | Feller, Moran; Ben-Ari, Eyal; Gupta, Tarkeshwar; Shimon, Linda J. W.; Leitus, Gregory; Diskin-Posner, Yael; Weiner, Lev; Milstein, David |
Journal of publication | Inorganic chemistry |
Year of publication | 2007 |
Journal volume | 46 |
Journal issue | 25 |
Pages of publication | 10479 - 10490 |
a | 14.643 ± 0.003 Å |
b | 12.744 ± 0.003 Å |
c | 15.667 ± 0.003 Å |
α | 90° |
β | 105.67 ± 0.03° |
γ | 90° |
Cell volume | 2815 ± 1.1 Å3 |
Cell temperature | 120 ± 2 K |
Ambient diffraction temperature | 120 ± 2 K |
Number of distinct elements | 8 |
Space group number | 14 |
Hermann-Mauguin space group symbol | P 1 21/c 1 |
Hall space group symbol | -P 2ybc |
Residual factor for all reflections | 0.0843 |
Residual factor for significantly intense reflections | 0.0493 |
Weighted residual factors for significantly intense reflections | 0.1113 |
Weighted residual factors for all reflections included in the refinement | 0.1237 |
Goodness-of-fit parameter for all reflections included in the refinement | 1.006 |
Diffraction radiation wavelength | 0.71073 Å |
Diffraction radiation type | MoKα |