Information card for entry 4333410
Formula | C26 H49 B2 F8 N O P2 Rh |
Calculated formula | C26 H49 B2 F8 N O P2 Rh |
Title of publication | Mononuclear Rh(II) PNP-type complexes. Structure and reactivity. |
Authors of publication | Feller, Moran; Ben-Ari, Eyal; Gupta, Tarkeshwar; Shimon, Linda J. W.; Leitus, Gregory; Diskin-Posner, Yael; Weiner, Lev; Milstein, David |
Journal of publication | Inorganic chemistry |
Year of publication | 2007 |
Journal volume | 46 |
Journal issue | 25 |
Pages of publication | 10479 - 10490 |
a | 29.248 ± 0.006 Å |
b | 14.051 ± 0.003 Å |
c | 19.768 ± 0.004 Å |
α | 90° |
β | 125.59 ± 0.03° |
γ | 90° |
Cell volume | 6606 ± 3 Å3 |
Cell temperature | 120 ± 2 K |
Ambient diffraction temperature | 120 ± 2 K |
Number of distinct elements | 8 |
Space group number | 15 |
Hermann-Mauguin space group symbol | C 1 2/c 1 |
Hall space group symbol | -C 2yc |
Residual factor for all reflections | 0.0706 |
Residual factor for significantly intense reflections | 0.0462 |
Weighted residual factors for significantly intense reflections | 0.1189 |
Weighted residual factors for all reflections included in the refinement | 0.128 |
Goodness-of-fit parameter for all reflections included in the refinement | 0.986 |
Diffraction radiation wavelength | 0.71073 Å |
Diffraction radiation type | MoKα |