Information card for entry 4338706
Common name | Phenanthroline homocitrato vanadate(V/IV) |
Formula | C43 H44 Cl N6 O16 V2 |
Calculated formula | C43 H44.5 Cl N6 O16 V2 |
Title of publication | Formations of mixed-valence oxovanadiumV,IV citrates and homocitrate with N-heterocycle chelated ligand. |
Authors of publication | Chen, Can-Yu; Zhou, Zhao-Hui; Chen, Hong-Bin; Huang, Pei-Qiang; Tsai, Khi-Rui; Chow, Yuan L. |
Journal of publication | Inorganic chemistry |
Year of publication | 2008 |
Journal volume | 47 |
Journal issue | 19 |
Pages of publication | 8714 - 8720 |
a | 12.9695 ± 0.0008 Å |
b | 13.6195 ± 0.0008 Å |
c | 15.4979 ± 0.0009 Å |
α | 71.586 ± 0.005° |
β | 78.905 ± 0.005° |
γ | 63.745 ± 0.006° |
Cell volume | 2324.9 ± 0.3 Å3 |
Cell temperature | 173 ± 2 K |
Ambient diffraction temperature | 173 ± 2 K |
Number of distinct elements | 6 |
Space group number | 2 |
Hermann-Mauguin space group symbol | P -1 |
Hall space group symbol | -P 1 |
Residual factor for all reflections | 0.0787 |
Residual factor for significantly intense reflections | 0.0589 |
Weighted residual factors for significantly intense reflections | 0.1667 |
Weighted residual factors for all reflections included in the refinement | 0.1768 |
Goodness-of-fit parameter for all reflections included in the refinement | 0.971 |
Diffraction radiation wavelength | 1.5418 Å |
Diffraction radiation type | CuKα |