Information card for entry 4338707
Formula | C84 H82 N12 O32 V4 |
Calculated formula | C84 H82 N12 O32 V4 |
Title of publication | Formations of mixed-valence oxovanadiumV,IV citrates and homocitrate with N-heterocycle chelated ligand. |
Authors of publication | Chen, Can-Yu; Zhou, Zhao-Hui; Chen, Hong-Bin; Huang, Pei-Qiang; Tsai, Khi-Rui; Chow, Yuan L. |
Journal of publication | Inorganic chemistry |
Year of publication | 2008 |
Journal volume | 47 |
Journal issue | 19 |
Pages of publication | 8714 - 8720 |
a | 13.0831 ± 0.0005 Å |
b | 13.0996 ± 0.0004 Å |
c | 14.8791 ± 0.0005 Å |
α | 101.442 ± 0.003° |
β | 105.709 ± 0.003° |
γ | 115.186 ± 0.003° |
Cell volume | 2072.48 ± 0.16 Å3 |
Cell temperature | 173 ± 2 K |
Ambient diffraction temperature | 173 ± 2 K |
Number of distinct elements | 5 |
Space group number | 2 |
Hermann-Mauguin space group symbol | P -1 |
Hall space group symbol | -P 1 |
Residual factor for all reflections | 0.0348 |
Residual factor for significantly intense reflections | 0.0309 |
Weighted residual factors for significantly intense reflections | 0.0938 |
Weighted residual factors for all reflections included in the refinement | 0.0956 |
Goodness-of-fit parameter for all reflections included in the refinement | 1.096 |
Diffraction radiation wavelength | 1.5418 Å |
Diffraction radiation type | CuKα |