Information card for entry 4338842
Formula |
H40 Mn2 N20 Se4 Sn |
Calculated formula |
H40 Mn2 N20 Se4 Sn |
Title of publication |
Controlled assembly of zero-, one-, two-, and three-dimensional metal chalcogenide structures. |
Authors of publication |
Yuan, Min; Dirmyer, Matthew; Badding, John; Sen, Ayusman; Dahlberg, Maria; Schiffer, Peter |
Journal of publication |
Inorganic chemistry |
Year of publication |
2007 |
Journal volume |
46 |
Journal issue |
18 |
Pages of publication |
7238 - 7240 |
a |
10.304 ± 0.004 Å |
b |
13.182 ± 0.005 Å |
c |
18.27 ± 0.007 Å |
α |
90° |
β |
97.657 ± 0.007° |
γ |
90° |
Cell volume |
2459.4 ± 1.6 Å3 |
Cell temperature |
115 ± 2 K |
Ambient diffraction temperature |
115 ± 2 K |
Number of distinct elements |
5 |
Space group number |
14 |
Hermann-Mauguin space group symbol |
P 1 21/c 1 |
Hall space group symbol |
-P 2ybc |
Residual factor for all reflections |
0.0397 |
Residual factor for significantly intense reflections |
0.0334 |
Weighted residual factors for significantly intense reflections |
0.0745 |
Weighted residual factors for all reflections included in the refinement |
0.0765 |
Goodness-of-fit parameter for all reflections included in the refinement |
1.111 |
Diffraction radiation wavelength |
0.71073 Å |
Diffraction radiation type |
MoKα |
Yes |
No |
No |