Information card for entry 4342308
Formula | C25.9 H30.7 Ga0.95 Pb0.05 |
Calculated formula | C25.9 H30.7 Ga0.95 Pb0.05 |
Title of publication | Reaction of a germylene, stannylene, or plumbylene with trimethylaluminum and trimethylgallium: insertion into Al-C or ga-C bonds, a reversible metal-carbon insertion equilibrium, and a new route to diplumbenes. |
Authors of publication | Erickson, Jeremy D.; Fettinger, James C.; Power, Philip P. |
Journal of publication | Inorganic chemistry |
Year of publication | 2015 |
Journal volume | 54 |
Journal issue | 4 |
Pages of publication | 1940 - 1948 |
a | 11.6704 ± 0.0005 Å |
b | 12.4932 ± 0.0005 Å |
c | 15.2679 ± 0.0006 Å |
α | 90° |
β | 90.482 ± 0.001° |
γ | 90° |
Cell volume | 2225.99 ± 0.16 Å3 |
Cell temperature | 90 ± 2 K |
Ambient diffraction temperature | 90 ± 2 K |
Number of distinct elements | 4 |
Space group number | 14 |
Hermann-Mauguin space group symbol | P 1 21/n 1 |
Hall space group symbol | -P 2yn |
Residual factor for all reflections | 0.0419 |
Residual factor for significantly intense reflections | 0.0395 |
Weighted residual factors for significantly intense reflections | 0.1049 |
Weighted residual factors for all reflections included in the refinement | 0.1073 |
Goodness-of-fit parameter for all reflections included in the refinement | 1.079 |
Diffraction radiation wavelength | 1.54178 Å |
Diffraction radiation type | CuKα |