Information card for entry 4342371
Formula | C20 H20 Cl4 Fe O2 Rb S4 |
Calculated formula | C20 H20 Cl4 Fe O2 Rb S4 |
Title of publication | Coordination Polymers Based on Diiron Tetrakis(dithiolato) Bridged by Alkali Metals, Electrical Bistability around Room Temperature, and Strong Antiferromagnetic Coupling. |
Authors of publication | Benmansour, Samia; Delgado, Esther; Gómez-García, Carlos J; Hernández, Diego; Hernández, Elisa; Martin, Avelino; Perles, Josefina; Zamora, Félix |
Journal of publication | Inorganic chemistry |
Year of publication | 2015 |
Journal volume | 54 |
Journal issue | 5 |
Pages of publication | 2243 |
a | 8.3909 ± 0.0005 Å |
b | 12.2239 ± 0.0006 Å |
c | 13.3861 ± 0.0006 Å |
α | 73.062 ± 0.004° |
β | 81.438 ± 0.004° |
γ | 86.627 ± 0.005° |
Cell volume | 1298.63 ± 0.12 Å3 |
Cell temperature | 200 ± 2 K |
Ambient diffraction temperature | 200 ± 2 K |
Number of distinct elements | 7 |
Space group number | 2 |
Hermann-Mauguin space group symbol | P -1 |
Hall space group symbol | -P 1 |
Residual factor for all reflections | 0.1031 |
Residual factor for significantly intense reflections | 0.054 |
Weighted residual factors for significantly intense reflections | 0.1017 |
Weighted residual factors for all reflections included in the refinement | 0.1212 |
Goodness-of-fit parameter for all reflections included in the refinement | 1.07 |
Diffraction radiation probe | x-ray |
Diffraction radiation wavelength | 0.71073 Å |
Diffraction radiation type | MoKα |