Information card for entry 4342372
Formula | C20 H20 Cl4 Cs Fe O2 S4 |
Calculated formula | C20 H20 Cl4 Cs Fe O2 S4 |
Title of publication | Coordination Polymers Based on Diiron Tetrakis(dithiolato) Bridged by Alkali Metals, Electrical Bistability around Room Temperature, and Strong Antiferromagnetic Coupling. |
Authors of publication | Benmansour, Samia; Delgado, Esther; Gómez-García, Carlos J; Hernández, Diego; Hernández, Elisa; Martin, Avelino; Perles, Josefina; Zamora, Félix |
Journal of publication | Inorganic chemistry |
Year of publication | 2015 |
Journal volume | 54 |
Journal issue | 5 |
Pages of publication | 2243 |
a | 8.34 ± 0.004 Å |
b | 12.086 ± 0.003 Å |
c | 13.806 ± 0.006 Å |
α | 74.44 ± 0.02° |
β | 80.27 ± 0.03° |
γ | 86.24 ± 0.03° |
Cell volume | 1321 ± 0.9 Å3 |
Cell temperature | 200 ± 2 K |
Ambient diffraction temperature | 200 ± 2 K |
Number of distinct elements | 7 |
Space group number | 2 |
Hermann-Mauguin space group symbol | P -1 |
Hall space group symbol | -P 1 |
Residual factor for all reflections | 0.1891 |
Residual factor for significantly intense reflections | 0.0816 |
Weighted residual factors for significantly intense reflections | 0.1949 |
Weighted residual factors for all reflections included in the refinement | 0.2508 |
Goodness-of-fit parameter for all reflections included in the refinement | 0.882 |
Diffraction radiation probe | x-ray |
Diffraction radiation wavelength | 0.71073 Å |
Diffraction radiation type | MoKα |