Information card for entry 4342373
Formula | C28 H36 Cl4 Fe Li O4 S4 |
Calculated formula | C28 H36 Cl4 Fe Li O4 S4 |
Title of publication | Coordination Polymers Based on Diiron Tetrakis(dithiolato) Bridged by Alkali Metals, Electrical Bistability around Room Temperature, and Strong Antiferromagnetic Coupling. |
Authors of publication | Benmansour, Samia; Delgado, Esther; Gómez-García, Carlos J; Hernández, Diego; Hernández, Elisa; Martin, Avelino; Perles, Josefina; Zamora, Félix |
Journal of publication | Inorganic chemistry |
Year of publication | 2015 |
Journal volume | 54 |
Journal issue | 5 |
Pages of publication | 2243 |
a | 11.0978 ± 0.0006 Å |
b | 13.1869 ± 0.0005 Å |
c | 13.7014 ± 0.0009 Å |
α | 114.408 ± 0.003° |
β | 94.859 ± 0.005° |
γ | 107.592 ± 0.004° |
Cell volume | 1689.04 ± 0.18 Å3 |
Cell temperature | 200 ± 2 K |
Ambient diffraction temperature | 200 ± 2 K |
Number of distinct elements | 7 |
Space group number | 2 |
Hermann-Mauguin space group symbol | P -1 |
Hall space group symbol | -P 1 |
Residual factor for all reflections | 0.2011 |
Residual factor for significantly intense reflections | 0.0798 |
Weighted residual factors for significantly intense reflections | 0.1528 |
Weighted residual factors for all reflections included in the refinement | 0.1989 |
Goodness-of-fit parameter for all reflections included in the refinement | 1.163 |
Diffraction radiation probe | x-ray |
Diffraction radiation wavelength | 0.71073 Å |
Diffraction radiation type | MoKα |