Information card for entry 4342389
Formula | C19 H33 Cl Co F6 N5 P |
Calculated formula | C19 H33 Cl Co F6 N5 P |
SMILES | [Co]1234(Cl)[n]5ccccc5C[N]51CCC[N]12CC[N]3(C)CCC[N]4(CC1)CC5.[P](F)(F)(F)(F)(F)[F-] |
Title of publication | Synthesis, Structural Studies, and Oxidation Catalysis of the Late-First-Row-Transition-Metal Complexes of a 2-Pyridylmethyl Pendant-Armed Ethylene Cross-Bridged Cyclam. |
Authors of publication | Jones, Donald G.; Wilson, Kevin R.; Cannon-Smith, Desiray J; Shircliff, Anthony D.; Zhang, Zhan; Chen, Zhuqi; Prior, Timothy J.; Yin, Guochuan; Hubin, Timothy J. |
Journal of publication | Inorganic chemistry |
Year of publication | 2015 |
Journal volume | 54 |
Journal issue | 5 |
Pages of publication | 2221 |
a | 18.6711 ± 0.0013 Å |
b | 8.6259 ± 0.001 Å |
c | 14.8088 ± 0.001 Å |
α | 90° |
β | 90° |
γ | 90° |
Cell volume | 2385 ± 0.4 Å3 |
Cell temperature | 150 ± 2 K |
Ambient diffraction temperature | 150 ± 2 K |
Number of distinct elements | 7 |
Space group number | 29 |
Hermann-Mauguin space group symbol | P c a 21 |
Hall space group symbol | P 2c -2ac |
Residual factor for all reflections | 0.0615 |
Residual factor for significantly intense reflections | 0.0329 |
Weighted residual factors for significantly intense reflections | 0.0584 |
Weighted residual factors for all reflections included in the refinement | 0.0637 |
Goodness-of-fit parameter for all reflections included in the refinement | 0.8 |
Diffraction radiation wavelength | 0.71073 Å |
Diffraction radiation type | MoKα |