Information card for entry 4342390
Formula | C19 H33 Cl F6 N5 Ni P |
Calculated formula | C19 H33 Cl F6 N5 Ni P |
SMILES | [Ni]1234(Cl)[n]5ccccc5C[N]51CCC[N]12CC[N]3(C)CCC[N]4(CC1)CC5.[P](F)(F)(F)(F)(F)[F-] |
Title of publication | Synthesis, Structural Studies, and Oxidation Catalysis of the Late-First-Row-Transition-Metal Complexes of a 2-Pyridylmethyl Pendant-Armed Ethylene Cross-Bridged Cyclam. |
Authors of publication | Jones, Donald G.; Wilson, Kevin R.; Cannon-Smith, Desiray J; Shircliff, Anthony D.; Zhang, Zhan; Chen, Zhuqi; Prior, Timothy J.; Yin, Guochuan; Hubin, Timothy J. |
Journal of publication | Inorganic chemistry |
Year of publication | 2015 |
Journal volume | 54 |
Journal issue | 5 |
Pages of publication | 2221 |
a | 22.758 ± 0.002 Å |
b | 13.73 ± 0.002 Å |
c | 15.0185 ± 0.0016 Å |
α | 90° |
β | 93.047 ± 0.008° |
γ | 90° |
Cell volume | 4686.2 ± 0.9 Å3 |
Cell temperature | 150 ± 2 K |
Ambient diffraction temperature | 150 ± 2 K |
Number of distinct elements | 7 |
Space group number | 14 |
Hermann-Mauguin space group symbol | P 1 21/c 1 |
Hall space group symbol | -P 2ybc |
Residual factor for all reflections | 0.0867 |
Residual factor for significantly intense reflections | 0.0452 |
Weighted residual factors for significantly intense reflections | 0.0976 |
Weighted residual factors for all reflections included in the refinement | 0.1062 |
Goodness-of-fit parameter for all reflections included in the refinement | 0.829 |
Diffraction radiation wavelength | 0.71073 Å |
Diffraction radiation type | MoKα |