Information card for entry 4342400
Formula | C7 H4 Ag3 O5 P |
Calculated formula | C7 H4 Ag3 O5 P |
Title of publication | Silver-Based Hybrid Materials from meta- or para-Phosphonobenzoic Acid: Influence of the Topology on Silver Release in Water. |
Authors of publication | Rueff, Jean-Michel; Perez, Olivier; Caignaert, Vincent; Hix, Gary; Berchel, Mathieu; Quentel, François; Jaffrès, Paul-Alain |
Journal of publication | Inorganic chemistry |
Year of publication | 2015 |
Journal volume | 54 |
Journal issue | 5 |
Pages of publication | 2152 |
a | 6.9399 ± 0.0004 Å |
b | 5.7694 ± 0.0002 Å |
c | 22.96 ± 0.0017 Å |
α | 90° |
β | 92.558 ± 0.006° |
γ | 90° |
Cell volume | 918.38 ± 0.09 Å3 |
Cell temperature | 293 K |
Ambient diffraction temperature | 293 K |
Number of distinct elements | 5 |
Space group number | 14 |
Hermann-Mauguin space group symbol | P 1 21/c 1 |
Hall space group symbol | -P 2ybc |
Residual factor for all reflections | 0.0881 |
Residual factor for significantly intense reflections | 0.0403 |
Weighted residual factors for significantly intense reflections | 0.0416 |
Weighted residual factors for all reflections included in the refinement | 0.0471 |
Goodness-of-fit parameter for significantly intense reflections | 1.63 |
Goodness-of-fit parameter for all reflections included in the refinement | 1.4 |
Diffraction radiation probe | x-ray |
Diffraction radiation wavelength | 0.71069 Å |
Diffraction radiation type | MoKα |