Information card for entry 4342417
Formula | H2 Ni2 O12 Pb Se4 |
Calculated formula | H2 Ni2 O12 Pb Se4 |
Title of publication | pH Controlled Pathway and Systematic Hydrothermal Phase Diagram for Elaboration of Synthetic Lead Nickel Selenites. |
Authors of publication | Kovrugin, Vadim M.; Colmont, Marie; Terryn, Christine; Colis, Silviu; Siidra, Oleg I.; Krivovichev, Sergey V.; Mentré, Olivier |
Journal of publication | Inorganic chemistry |
Year of publication | 2015 |
Journal volume | 54 |
Journal issue | 5 |
Pages of publication | 2425 |
a | 13.6824 ± 0.001 Å |
b | 5.2692 ± 0.0005 Å |
c | 19.3476 ± 0.0013 Å |
α | 90° |
β | 129.524 ± 0.004° |
γ | 90° |
Cell volume | 1075.95 ± 0.16 Å3 |
Cell temperature | 293 ± 2 K |
Ambient diffraction temperature | 293 ± 2 K |
Number of distinct elements | 5 |
Space group number | 13 |
Hermann-Mauguin space group symbol | P 1 2/c 1 |
Hall space group symbol | -P 2yc |
Residual factor for all reflections | 0.0783 |
Residual factor for significantly intense reflections | 0.0496 |
Weighted residual factors for significantly intense reflections | 0.0992 |
Weighted residual factors for all reflections included in the refinement | 0.1104 |
Goodness-of-fit parameter for all reflections included in the refinement | 1.187 |
Diffraction radiation wavelength | 0.71073 Å |
Diffraction radiation type | MoKα |