Information card for entry 4342418
Formula | Ni O6 Pb Se2 |
Calculated formula | Ni O6 Pb Se2 |
Title of publication | pH Controlled Pathway and Systematic Hydrothermal Phase Diagram for Elaboration of Synthetic Lead Nickel Selenites. |
Authors of publication | Kovrugin, Vadim M.; Colmont, Marie; Terryn, Christine; Colis, Silviu; Siidra, Oleg I.; Krivovichev, Sergey V.; Mentré, Olivier |
Journal of publication | Inorganic chemistry |
Year of publication | 2015 |
Journal volume | 54 |
Journal issue | 5 |
Pages of publication | 2425 |
a | 5.4715 ± 0.0004 Å |
b | 9.1963 ± 0.0006 Å |
c | 11.4436 ± 0.0009 Å |
α | 90° |
β | 90° |
γ | 90° |
Cell volume | 575.81 ± 0.07 Å3 |
Cell temperature | 293 ± 2 K |
Ambient diffraction temperature | 293 ± 2 K |
Number of distinct elements | 4 |
Space group number | 36 |
Hermann-Mauguin space group symbol | C m c 21 |
Hall space group symbol | C 2c -2 |
Residual factor for all reflections | 0.0142 |
Residual factor for significantly intense reflections | 0.0141 |
Weighted residual factors for significantly intense reflections | 0.0346 |
Weighted residual factors for all reflections included in the refinement | 0.0346 |
Goodness-of-fit parameter for all reflections included in the refinement | 1.109 |
Diffraction radiation wavelength | 0.71073 Å |
Diffraction radiation type | MoKα |