Information card for entry 4342432
Formula | C29 H31 Cl2 P Te |
Calculated formula | C29 H31 Cl2 P Te |
Title of publication | Peri-Substituted Phosphorus-Tellurium Systems-An Experimental and Theoretical Investigation of the P···Te through-Space Interaction. |
Authors of publication | Nordheider, Andreas; Hupf, Emanuel; Chalmers, Brian A.; Knight, Fergus R.; Bühl, Michael; Mebs, Stefan; Chęcińska, Lilianna; Lork, Enno; Camacho, Paula Sanz; Ashbrook, Sharon E.; Athukorala Arachchige, Kasun S.; Cordes, David B.; Slawin, Alexandra M. Z.; Beckmann, Jens; Woollins, J. Derek |
Journal of publication | Inorganic chemistry |
Year of publication | 2015 |
Journal volume | 54 |
Journal issue | 5 |
Pages of publication | 2435 |
a | 12.1171 ± 0.0013 Å |
b | 13.884 ± 0.0015 Å |
c | 15.8702 ± 0.0018 Å |
α | 90° |
β | 100.467 ± 0.002° |
γ | 90° |
Cell volume | 2625.5 ± 0.5 Å3 |
Cell temperature | 93 K |
Ambient diffraction temperature | 93 K |
Number of distinct elements | 5 |
Space group number | 13 |
Hermann-Mauguin space group symbol | P 1 2/c 1 |
Hall space group symbol | -P 2yc |
Residual factor for significantly intense reflections | 0.0687 |
Weighted residual factors for all reflections included in the refinement | 0.1971 |
Goodness-of-fit parameter for all reflections included in the refinement | 1.206 |
Diffraction radiation wavelength | 0.71075 Å |
Diffraction radiation type | MoKα |